Modify implementation to allow an API and a Common policies with same and version #9074
main.yml
on: pull_request
build-carbon
18m 56s
run-benchmark-test
52m 19s
Matrix: build-product
Annotations
5 errors and 11 warnings
build-product (1, group1)
APIProductCreationTestCase.testCreateAndInvokeApiProductWithOperationPoliciesInRequestApi
──────────────────────────────────────────────────────────────────────────────────────────
expected [200] but found [404]
──────────────────────────────────────────────────────────────────────────────────────────
java.lang.AssertionError: expected [200] but found [404]
at org.wso2.am.integration.tests.apiproduct.APIProductCreationTestCase.testCreateAndInvokeApiProductWithOperationPoliciesInRequestApi(APIProductCreationTestCase.java:523)
|
build-product (1, group1)
APIProductCreationTestCase.testCreateAndInvokeApiProductWithOperationPoliciesInRequestApi
──────────────────────────────────────────────────────────────────────────────────────────
expected [200] but found [404]
──────────────────────────────────────────────────────────────────────────────────────────
java.lang.AssertionError: expected [200] but found [404]
at org.wso2.am.integration.tests.apiproduct.APIProductCreationTestCase.testCreateAndInvokeApiProductWithOperationPoliciesInRequestApi(APIProductCreationTestCase.java:523)
|
build-product (1, group1)
APIProductCreationTestCase.testCreateAndInvokeApiProductWithOperationPoliciesInResponseApi
──────────────────────────────────────────────────────────────────────────────────────────
expected [200] but found [404]
──────────────────────────────────────────────────────────────────────────────────────────
java.lang.AssertionError: expected [200] but found [404]
at org.wso2.am.integration.tests.apiproduct.APIProductCreationTestCase.testCreateAndInvokeApiProductWithOperationPoliciesInResponseApi(APIProductCreationTestCase.java:618)
|
build-product (1, group1)
APIProductCreationTestCase.testCreateAndInvokeApiProductWithOperationPoliciesInResponseApi
──────────────────────────────────────────────────────────────────────────────────────────
expected [200] but found [404]
──────────────────────────────────────────────────────────────────────────────────────────
java.lang.AssertionError: expected [200] but found [404]
at org.wso2.am.integration.tests.apiproduct.APIProductCreationTestCase.testCreateAndInvokeApiProductWithOperationPoliciesInResponseApi(APIProductCreationTestCase.java:618)
|
build-product (1, group1)
Process completed with exit code 1.
|
build-carbon
ubuntu-latest pipelines will use ubuntu-24.04 soon. For more details, see https://github.com/actions/runner-images/issues/10636
|
run-benchmark-test
ubuntu-latest pipelines will use ubuntu-24.04 soon. For more details, see https://github.com/actions/runner-images/issues/10636
|
build-product (3, group3)
ubuntu-latest pipelines will use ubuntu-24.04 soon. For more details, see https://github.com/actions/runner-images/issues/10636
|
build-product (3, group3)
794 tests run, 0 skipped, 0 failed.
|
build-product (2, group2)
ubuntu-latest pipelines will use ubuntu-24.04 soon. For more details, see https://github.com/actions/runner-images/issues/10636
|
build-product (2, group2)
169 tests run, 0 skipped, 0 failed.
|
build-product (1, group1)
ubuntu-latest pipelines will use ubuntu-24.04 soon. For more details, see https://github.com/actions/runner-images/issues/10636
|
build-product (1, group1)
598 tests run, 4 skipped, 4 failed.
|
build-product (4, group4)
ubuntu-latest pipelines will use ubuntu-24.04 soon. For more details, see https://github.com/actions/runner-images/issues/10636
|
build-product (4, group4)
279 tests run, 0 skipped, 0 failed.
|
Deprecation notice: v1, v2, and v3 of the artifact actions
The following artifacts were uploaded using a version of actions/upload-artifact that is scheduled for deprecation: "TEST-TestSuite_1", "TEST-TestSuite_2", "TEST-TestSuite_3", "TEST-TestSuite_4".
Please update your workflow to use v4 of the artifact actions.
Learn more: https://github.blog/changelog/2024-04-16-deprecation-notice-v3-of-the-artifact-actions/
|
Artifacts
Produced during runtime
Name | Size | |
---|---|---|
TEST-TestSuite_1
|
24.6 MB |
|
TEST-TestSuite_2
|
15.6 MB |
|
TEST-TestSuite_3
|
19.2 MB |
|
TEST-TestSuite_4
|
35.4 MB |
|